BDBM49332 MLS000105932::SMR000102906::benzimidazolo[1,2-c][1,2,3]benzotriazine::cid_285054
SMILES c1ccc2c(c1)nc1c3ccccc3nnn21
InChI Key InChIKey=KPCXPWQRKNQBMW-UHFFFAOYSA-N
Data  2 EC50
  Tab Delimited (TSV)   2D SDfile   Computed 3D by Vconf -m prep SDfile
Find this compound or compounds like it in BindingDB:
Activity Spreadsheet -- Enzyme Inhibition Constant Data from BindingDB
Found 1 hit for monomerid = 49332
TargetHeat shock factor protein 1(Mus musculus)
Broad Institute
Curated by PubChem BioAssay
LigandPNGBDBM49332(MLS000105932 | SMR000102906 | benzimidazolo[1,2-c]...)
Affinity DataEC50: >2.60E+5nM. Assay description: Keywords: Heat Shock Factor-1 (HSF-1), Stress Response, MG132, NIH3T3, Luminescence Assay Overview: Confirmation testing of small molecules identifie...
In DepthDetails PCBioAssay